BDBM90880 7-(1-azepanyl)-3-(3,4-dimethoxyphenyl)-2,5-dimethylpyrazolo[1,5-a]pyrimidine::7-(azepan-1-yl)-3-(3,4-dimethoxyphenyl)-2,5-dimethyl-pyrazolo[1,5-a]pyrimidine::7-(azepan-1-yl)-3-(3,4-dimethoxyphenyl)-2,5-dimethylpyrazolo[1,5-a]pyrimidine::7-azepan-1-yl-3-(3,4-dimethoxyphenyl)-2,5-dimethylpyrazolo[1,5-a]pyrimidine::MLS001199361::SMR000562847::cid_7476690
SMILES COc1ccc(cc1OC)-c1c(C)nn2c(cc(C)nc12)N1CCCCCC1
InChI Key InChIKey=LQIKIIQCRJZOJL-UHFFFAOYSA-N
Data  1 IC50  1 EC50
  Tab Delimited (TSV)   2D SDfile   Computed 3D by Vconf -m prep SDfile
Find this compound or compounds like it in BindingDB:
Activity Spreadsheet -- Enzyme Inhibition Constant Data from BindingDB
Found 2 hits for monomerid = 90880
TargetCorticotropin-releasing factor-binding protein(Homo sapiens (Human))
Burnham Center For Chemical Genomics
Curated by PubChem BioAssay
LigandPNGBDBM90880(7-(1-azepanyl)-3-(3,4-dimethoxyphenyl)-2,5-dimethy...)
Affinity DataIC50:  2.00E+4nM
In DepthDetails PCBioAssay
TargetCorticotropin-releasing factor-binding protein(Homo sapiens (Human))
Burnham Center For Chemical Genomics
Curated by PubChem BioAssay
LigandPNGBDBM90880(7-(1-azepanyl)-3-(3,4-dimethoxyphenyl)-2,5-dimethy...)
Affinity DataEC50: >5.30E+4nM. Assay description: Data Source: Sanford-Burnham Center for Chemical Genomics (SBCCG) Source Affiliation: Sanford-Burnham Medical Research Institute (SBMRI, San Diego, C...
In DepthDetails PCBioAssay